poundal per inch
type: Concept
definition: Non SI-conforming unit of the surface tension according to the Imperial unit system as quotient poundal by inch.
in scheme: unit-of-measure
notation: N32
conversion multiplier: 5.44310844
dimension vector: M1 T-2
rec20 quantity: surface tension
rec20 sector: Mechanics
ucum code: [lb_av].[ft_i].s-2.[in_i]-1
unit symbol: pdl/in