cubic foot per pound
type: Concept
definition: Power of the unit foot according to the Anglo-American and Imperial system of units by exponent 3 divided by the unit avoirdupois pound according to the avoirdupois unit system.
in scheme: unit-of-measure
notation: N29
conversion multiplier: 0.06242796057614461
dimension vector: L3 M-1
rec20 quantity: specific volume, massic volume
rec20 sector: Mechanics
ucum code: [ft_i]3.[lb_av]-1
unit symbol: ft³/lb