cubic decimetre per kilogram
type: Concept
definition: 0,001 fold of the power of the SI base unit meter by exponent 3 divided by the SI based unit kilogram.
in scheme: unit-of-measure
notation: N28
conversion multiplier: 0.001
dimension vector: L3 M-1
rec20 quantity: specific volume, massic volume
rec20 sector: Mechanics
ucum code: dm3.kg-1
unit symbol: dm³/kg