poundal per square inch
type: Concept
definition: Non SI-conforming unit of the pressure according to the Imperial system of units (poundal by square inch).
in scheme: unit-of-measure
notation: N26
conversion multiplier: 214.29560787401576
dimension vector: L-1 M1 T-2
rec20 quantity: pressure, normal stress, shear stress, modulus of elasticity,shear modulus, modulus of rigidity, bulk modulus, modulus of compression
rec20 sector: Mechanics
ucum code: [lb_av].[ft_i].s-2.[in_i]-2
unit symbol: pdl/in²