pound per square yard
type: Concept
definition: Unit for areal-related mass as a unit pound according to the avoirdupois unit system divided by the power of the unit yard according to the Anglo-American and Imperial system of units with exponent 2.
in scheme: unit-of-measure
notation: N25
conversion multiplier: 0.5424919595981167
dimension vector: L-2 M1
rec20 quantity: pressure, normal stress, shear stress, modulus of elasticity,shear modulus, modulus of rigidity, bulk modulus, modulus of compression
rec20 sector: Mechanics
ucum code: [lb_av].[yd_i]-2
unit symbol: lb/yd²