conventional metre of water
type: Concept
definition: Not SI-conforming unit of pressure, whereas a value of 1 mH2O is equivalent to the static pressure, which is produced by one metre high water column .
in scheme: unit-of-measure
notation: N23
dimension vector: L-1 M1 T-2
rec20 quantity: pressure, normal stress, shear stress, modulus of elasticity,shear modulus, modulus of rigidity, bulk modulus, modulus of compression
rec20 sector: Mechanics
unit symbol: mH₂O