inch of water (60 ºF)
type: Concept
definition: Non SI-conforming unit of pressure according to the Anglo-American and Imperial system for units, whereas the value of 1 inH2O meets the static pressure, which is generated by a head of water at a temperature of 60°F with a height of 1 inch .
in scheme: unit-of-measure
notation: N19
dimension vector: L-1 M1 T-2
rec20 quantity: pressure, normal stress, shear stress, modulus of elasticity,shear modulus, modulus of rigidity, bulk modulus, modulus of compression
rec20 sector: Mechanics
unit symbol: inH₂O (60 ºF)