Pferdestaerke
type: Concept
definition: Obsolete unit of the power relating to DIN 1301-3:1979: 1 PS = 735,498 75 W.
in scheme: unit-of-measure
notation: N12
dimension vector: L2 M1 T-3
rec20 quantity: power
rec20 sector: Mechanics
unit symbol: PS