month
type: Concept
definition: Unit of time equal to 1/12 of a year of 365,25 days.
in scheme: unit-of-measure
notation: MON
conversion multiplier: 2551442.976
dimension vector: T1
rec20 quantity: time
rec20 sector: Space and Time
ucum code: mo
unit symbol: mo