newton metre per radian
type: Concept
definition: Product of the derived SI unit newton and the SI base unit metre divided by the unit radian.
in scheme: unit-of-measure
notation: M93
conversion multiplier: 1.0
conversion offset: 0.0
dimension vector: L2 M1 T-2
rec20 quantity: moment of force, moment of a couple, torque
rec20 sector: Mechanics
ucum code: N.m.rad-1
unit symbol: N·m/rad