kilopound per hour
type: Concept
definition: 1000-fold of the unit of the mass avoirdupois pound according to the avoirdupois unit system divided by the unit hour.
in scheme: unit-of-measure
notation: M90
dimension vector: M1 T-1
rec20 quantity: mass flow rate
rec20 sector: Mechanics
unit symbol: klb/h