tonne per year
type: Concept
definition: Unit tonne divided by the unit year with 365 days.
in scheme: unit-of-measure
notation: M89
conversion multiplier: 3.168808781e-05
dimension vector: M1 T-1
rec20 quantity: mass flow rate
rec20 sector: Mechanics
ucum code: t.a-1
unit symbol: t/y