denier
type: Concept
definition: Traditional unit for the indication of the linear mass of textile fibers and yarns.
in scheme: unit-of-measure
notation: M83
rec20 quantity: linear density, linear mass
rec20 sector: Mechanics
unit symbol: den