square centimetre per second
type: Concept
definition: 0,000 1-fold of the power of the SI base unit metre by exponent 2 divided by the SI base unit second.
in scheme: unit-of-measure
notation: M81
conversion multiplier: 0.0001
dimension vector: L2 T-1
rec20 quantity: kinematic viscosity
rec20 sector: Mechanics
ucum code: cm2.s-1
unit symbol: cm²/s