square foot per hour
type: Concept
definition: Power of the unit foot according to the Anglo-American and Imperial system of units by exponent 2 divided by the unit of time hour.
in scheme: unit-of-measure
notation: M79
conversion multiplier: 2.58064e-05
dimension vector: L2 T-1
rec20 quantity: kinematic viscosity
rec20 sector: Mechanics
ucum code: [sft_i].h-1
unit symbol: ft²/h