pond
type: Concept
definition: 0,001-fold of the unit of the weight, defined as a mass of 1 kg which finds out about a weight strength from 1 kp by the gravitational force at sea level which corresponds to a strength of 9,806 65 newton.
in scheme: unit-of-measure
notation: M78
conversion multiplier: 0.00980665
dimension vector: L1 M1 T-2
rec20 quantity: force, weight
rec20 sector: Mechanics
unit symbol: p