cubic metre per pascal
type: Concept
definition: Power of the SI base unit meter by exponent 3 divided by the derived SI base unit pascal.
in scheme: unit-of-measure
notation: M71
conversion multiplier: 1.0
dimension vector: L4 M-1 T2
rec20 quantity: volume
rec20 sector: Space and Time
ucum code: m3.Pa-1
unit symbol: m³/Pa