cord (128 ft3)
type: Concept
definition: Traditional unit of the volume of stacked firewood which has been measured with a cord.
in scheme: unit-of-measure
notation: M68
conversion multiplier: 3.62
dimension vector: L3
rec20 quantity: volume
rec20 sector: Space and Time
ucum code: [crd_us]
unit symbol: cord