yard per second
type: Concept
definition: Unit yard according to the Anglo-American and Imperial system of units divided by the SI base unit second.
in scheme: unit-of-measure
notation: M64
conversion multiplier: 0.9144
dimension vector: L1 T-1
rec20 quantity: velocity, phase velocity, group velocity
rec20 sector: Space and Time
ucum code: [yd_i].s-1
unit symbol: yd/s