inch per minute
type: Concept
definition: Unit inch according to the Anglo-American and Imperial system of units divided by the unit minute.
in scheme: unit-of-measure
notation: M63
conversion multiplier: 0.000423333333
dimension vector: L1 T-1
rec20 quantity: velocity, phase velocity, group velocity
rec20 sector: Space and Time
ucum code: [in_i].min-1
unit symbol: in/min