kilometre per second
type: Concept
definition: 1000-fold of the SI base unit metre divided by the SI base unit second.
in scheme: unit-of-measure
notation: M62
conversion multiplier: 1000.0
dimension vector: L1 T-1
rec20 quantity: velocity, phase velocity, group velocity
rec20 sector: Space and Time
ucum code: km.s-1
unit symbol: km/s