inch per year
type: Concept
definition: Unit of the length according to the Anglo-American and Imperial system of units divided by the unit common year with 365 days.
in scheme: unit-of-measure
notation: M61
conversion multiplier: 8.048774e-10
dimension vector: L1 T-1
rec20 quantity: velocity, phase velocity, group velocity
rec20 sector: Space and Time
ucum code: [in_i].a-1
unit symbol: in/y