foot (U.S. survey)
type: Concept
definition: Unit commonly used in the United States for ordnance survey._x000D_
in scheme: unit-of-measure
notation: M51
conversion multiplier: 0.3048006
dimension vector: L1
rec20 quantity: length, breadth, height, thickness, radius, radius of curvature, cartesian coordinates, diameter, length of path, distance
rec20 sector: Space and Time
ucum code: [ft_us]
unit symbol: ft (US survey)