circular mil
type: Concept
definition: Unit of an area, of which the size is given by a diameter of length of 1 mm (0,001 in) based on the formula: area = p·(diameter/2)².
in scheme: unit-of-measure
notation: M47
conversion multiplier: 5.067075e-10
dimension vector: L2
rec20 quantity: area
rec20 sector: Space and Time
ucum code: [cml_i]
unit symbol: cmil