degree [unit of angle] per second squared
type: Concept
definition: 360 part of a full circle divided by the power of the SI base unit second and the exponent 2.
in scheme: unit-of-measure
notation: M45
conversion multiplier: 0.0174532925
dimension vector: T-2
rec20 quantity: angular acceleration
rec20 sector: Space and Time
ucum code: deg.s-2
unit symbol: °/s²