revolution
type: Concept
definition: Unit to identify an angle of the full circle of 360° or 2·p·rad (Refer ISO/TC12 SI Guide).
in scheme: unit-of-measure
notation: M44
conversion multiplier: 6.28318531
dimension vector: 1
rec20 quantity: angle (plane)
rec20 sector: Space and Time
unit symbol: rev