mile (statute mile) per second squared
type: Concept
definition: Unit of the length according to the Imperial system of units divided by the power of the SI base unit second by exponent 2.
in scheme: unit-of-measure
notation: M42
conversion multiplier: 1609.347
dimension vector: L1 T-2
rec20 quantity: acceleration, acceleration of free fall, acceleration due to gravity
rec20 sector: Space and Time
ucum code: [mi_us].s-2
unit symbol: mi/s²