millimetre per second squared
type: Concept
definition: 0,001-fold of the SI base unit metre divided by the power of the SI base unit second by exponent 2.
in scheme: unit-of-measure
notation: M41
conversion multiplier: 0.001
dimension vector: L1 T-2
rec20 quantity: acceleration, acceleration of free fall, acceleration due to gravity
rec20 sector: Space and Time
ucum code: mm.s-2
unit symbol: mm/s²