Kilowatt hour per normalized cubic metre
type: Concept
definition: Kilowatt hour per normalized cubic metre (temperature 0°C and pressure 101325 millibars ).
in scheme: unit-of-measure
notation: KWN
rec20 sector: Mechanics