kilolux
type: Concept
definition: A unit of illuminance equal to one thousand lux.
in scheme: unit-of-measure
notation: KLX
rec20 quantity: illuminance
rec20 sector: Light and Related Electromagnetic Radiations
unit symbol: klx