tonne per hour
type: Concept
definition: A unit of weight or mass equal to one tonne per hour.
in scheme: unit-of-measure
notation: E18
conversion multiplier: 0.277777777777778
dimension vector: M1 T-1
rec20 quantity: mass flow rate
rec20 sector: Mechanics
ucum code: t.h-1
unit symbol: t/h