milliampere hour
type: Concept
definition: A unit of power load delivered at the rate of one thousandth of an ampere over a period of one hour.
in scheme: unit-of-measure
notation: E09
conversion multiplier: 3.6
dimension vector: I1 T1
rec20 quantity: electric charge, quantity of electricity, electric flux (flux of displacement)
rec20 sector: Electricity and Magnetism
ucum code: mA.h
unit symbol: mA·h