var
type: Concept
definition: The name of the unit is an acronym for volt-ampere-reactive.
in scheme: unit-of-measure
notation: D44
conversion multiplier: 1.0
dimension vector: L2 M1 T-3
rec20 quantity: reactive power
rec20 sector: Electricity and Magnetism
ucum code: VA{reactive}
unit symbol: var