tropical year
type: Concept
definition: Unit of time equal to about 365.242 19 days. Synonym: solar year
in scheme: unit-of-measure
notation: D42
conversion multiplier: 31556925.216
dimension vector: T1
rec20 quantity: time
rec20 sector: Space and Time
ucum code: a_t
unit symbol: y (tropical)