octave
type: Concept
definition: A unit used in music to describe the ratio in frequency between notes.
in scheme: unit-of-measure
notation: C59
dimension vector: 1
rec20 quantity: frequency interval
rec20 sector: Acoustics