A unit of pressure defining the number of kilopounds force per square inch. Use kip per square inch (common code N20).
type: Concept
deprecated: true
definition: A unit of pressure defining the number of kilopounds force per square inch.
in scheme: unit-of-measure
notation: 84
conversion multiplier: 6894757.89
dimension vector: L-1 M1 T-2
rec20 quantity: pressure, normal stress, shear stress, modulus of elasticity,shear modulus, modulus of rigidity, bulk modulus, modulus of compression
rec20 sector: Mechanics
ucum code: k[lbf_av].[sin_i]-1
unit symbol: klbf/in²