tunnel restriction code
type: ObjectProperty
comment: added from BSP (per-class property assessment)
definition: The code specifying the tunnel restriction for these transported dangerous goods.
domain includes: DangerousGoods
range includes: any-code
term status: proposed