transport service priority code
type: ObjectProperty
comment: added from BSP (default-keep re-triage)
definition: The code specifying the priority of this transport service.
domain includes: Service
range includes: transport-service-priority-code-list
term status: proposed