transport service category type code
type: ObjectProperty
comment: added from BSP (per-class property assessment)
definition: A code specifying a type of category for this transport service.
domain includes: Service
range includes: transport-service-category-code-list
term status: proposed