transport route status code
type: ObjectProperty
comment: added from BSP (per-class property assessment)
definition: The code specifying a status for a transport route, such as planned or actual.
domain includes: TransportRoute
range includes: status-code-list
term status: proposed