transport movement type
type: DatatypeProperty
comment: restored from BSP (default-keep re-triage)
definition: The type, as expressed as text, of the logistics transport movement.
domain includes: TransportMovement
range includes: string
term status: proposed