trading business name
type: DatatypeProperty
comment: added from BSP (default-keep re-triage)
definition: The trading business name, expressed as text, of this legally set up organization.
domain includes: Organisation
range includes: string
term status: proposed