trade tax function code
type: ObjectProperty
comment: added from BSP (per-class property assessment)
definition: A code specifying the function of this trade tax.
domain includes: TradeTax
range includes: any-code
term status: proposed