trade payment terms instruction type code
type: ObjectProperty
comment: added from BSP (per-class property assessment)
definition: A code specifying a type of instruction for these trade payment terms.
domain includes: PaymentTerms
range includes: any-code
term status: proposed