tax type
type: DatatypeProperty
comment: added from BSP (per-class property assessment)
domain includes: TradeTax
range includes: string
definition: The type, expressed as text, of this trade related tax, levy or duty.
term status: proposed