tax point date
type: DatatypeProperty
comment: added from BSP (per-class property assessment)
domain includes: TradeTax
range includes: date
definition: The date of the tax point when taxes, such as VAT, are to be applied.
term status: proposed