tax payment method code
type: ObjectProperty
comment: code → payment-method scheme (re-added from BSP).
definition: The payment method for this tax, levy or duty.
domain includes: TradeTax
range includes: payment-method-code-list
term status: proposed