tax exemption reason code
type: ObjectProperty
comment: code → tax-exemption-reason scheme (re-added from BSP).
domain includes: TradeTax
range includes: tax-exemption-reason-code-list
definition: The reason for exemption from this tax, levy or duty.
term status: proposed