tax due date type code
type: ObjectProperty
comment: code → time-reference scheme (re-added from BSP).
definition: The type of due date for this tax.
domain includes: TradeTax
range includes: time-reference-code-list
term status: proposed