tax category code
type: ObjectProperty
comment: code → tax-category scheme (re-added from BSP).
definition: The category to which this tax, levy or duty applies (e.g. standard, reduced, zero, exempt).
domain includes: TradeTax
range includes: tax-category-code-list
term status: proposed